AfvalProductie
usage note: Het produceren van afval en afvalstoffen binnen een exploitatie.
comment: De afvalproductie van een bedrijf op een bepaalde locatie in een bepaald jaar.
subclass of: Class
  intersection of:
    some values from: Observation
    on property: subjectOf
subclass of: Activity
type: Class

Bijlage grondstoffenproducent
type: Property

verwerker van
type: ObjectProperty

pompfilter
usage note: TO DO
comment: TO DO
range: Class
  union of: Pompfilter
domain: Pompput
inverse of: pompfilter van
type: ObjectProperty

aantal punten
usage note: TO DO
comment: Aantal punten indien gegevens voor meerdere bronnen gegroepeerd zijn
range: integer
type: DatatypeProperty

instrument peilmeting
usage note: TO DO
comment: TO DO
range: Concept
domain: Peilmeting
type: ObjectProperty

BroeikasgasInstallatie
type: Class

verontreinigende stof
code list: substantie
usage note: te gebruiken als dimensie op een observatie.
comment: De naam van de verontreinigende stof (te kiezen uit een vaste lijst)
type: ObjectProperty
type: DimensionProperty
type: CodedProperty

Aanvulling afvalverwerker
type: Property

parameter
code list: parameter
usage note: TO DO
comment: TO DO
range: Concept
type: ObjectProperty
type: CodedProperty
type: DimensionProperty

debietmeter van
type: ObjectProperty

ritme
usage note: TO DO
comment: Vrij in te geven bv continue, 1x per dag
range: string
type: DatatypeProperty

gewonnen volume
usage note: TO DO
comment: TO DO
range: Waarde
type: ObjectProperty

Toelichtingevolutieemissies wateremissie
type: Property

Afval Verwerking
subclass of: Activity
subclass of: Class
  intersection of:
    some values from: Verwerker
    on property: verwerker
type: Class

verwerker
range: Verwerker
domain: Afval Verwerking
inverse of: verwerker van
type: ObjectProperty

concentratie
usage note: TO DO
comment: Gemiddelde concentratie eenheidsvolume ofwel in droge ofwel in natte toestand -- xs:decimal met minInclusive = 0
range: Waarde
type: ObjectProperty

lengte
range: Thing
type: ObjectProperty

rest: nil
first:
  cardinality: 1
  on property: serienummer

Waterbalans
usage note: TO DO
comment: TO DO
subclass of: Entity
type: Class

niscode
usage note: TO DO
comment: TO DO
range: Concept
type: FunctionalProperty
type: ObjectProperty

Bijlage luchtemissie
type: Property

heeftSaneringsplanZwareMetalen
comment: ivm. gpbv
range: boolean
type: DatatypeProperty

vlarem rubriek
usage note: Te gebruiken als een versie van een rubriek die als concept is gedefinieerd
comment: Representeert een onderdeel van de indelingslijst (Vlarem II) met een welbepaalde omschrijving van een inrichting of activiteit met een tijdsperiode waarbinnen deze versie van de rubriek geldig was.
subclass of: LegalExpression
type: Class

Aanmaning
type: Property

zuiveringsapparatuur
usage note: TO DO
comment: TO DO
range: Device
inverse of: zuiverings apparatuur van
type: ObjectProperty

verwijzing naar RIE
usage note: TO DO
comment: Verwijzing naar RIE wettekst
range: Concept
type: ObjectProperty

Pompput
comment: Put waaruit grondwater wordt opgepompt.
subclass of: Class
  intersection of:
    on class: Pompfilter
    min qualified cardinality: 1
    on property: pompfilter
subclass of: Location
type: Class

overbrenging van
type: ObjectProperty

meetwaarde
usage note: OPGELET: binnen een datacube te gebruiken als datatype property. Buiten een datacube te gebruiken als objectproperty met als waarde een instance van imjv:Waarde.
comment: Een meetwaarde van een parameter.
range: Class
  union of: decimal
type: MeasureProperty
type: DatatypeProperty

periode
usage note: TO DO
comment: Vrij in te geven periode bv continue, 200 dagen per jaar
range: integer
type: DatatypeProperty

Aangifte luchtemissie
type: Property

tijd
range: time
type: DatatypeProperty

Bijlage afvaloverbrenger
type: Property

afvalcode
range: Concept
type: ObjectProperty
type: DimensionProperty

vestiging
usage note: TO DO
comment: TO DO
range: Organization
inverse of: vestiging van
type: ObjectProperty

verwerking
range: Afval Verwerking
domain: AfvalProductie
inverse of: verwerking van
type: ObjectProperty

equivalente diameter
usage note: TO DO
comment: diameter (in meter) -- xs:decimal met minInclusive 0
range: Waarde
type: ObjectProperty

PeilfilterStaat
usage note: Te gebruiken voor het opslaan van de tijdelijke status van een peilfilter.
comment: Geeft de staat (status) weer van een peilfilter op een bepaald moment in de tijd.
subclass of: State
type: Class

rest:
  rest: nil
  first:
    cardinality: 1
    on property: date
first:
  qualified cardinality: 1
  on class: Exploitatie
  on property: exploitatie

hoeveelheid
usage note: OPGELET: binnen een datacube te gebruiken als datatype property. Buiten een datacube te gebruiken als objectproperty met als waarde een instance van imjv:Waarde.
comment: Bijvoorbeeld: Emissie hoeveelheid op te geven in t/jr of mg TEQ/jr. Optioneel kan ook de meetmethode opgegeven worden (door hier het ID van de meetmethode op te geven) -- xs:decimal met minInclusive = 0 Maar wordt ook gebruikt in andere types zoals Capaciteit.
range: Class
  union of: decimal
type: ObjectProperty
type: MeasureProperty

Aanvulling identificatie
type: Property

hoofdactiviteit
usage note: TO DO
comment: TO DO
range: Activity
inverse of: hoofd activiteit van
sub property of: inrichting of activiteit
type: FunctionalProperty
type: ObjectProperty

datum laatste ijking
usage note: TO DO
comment: TO DO
range: date
domain: Device
type: DatatypeProperty

merDossier
usage note: TO DO
comment: link naar het mer-dossier dat op de eenheid van toepassing is
range: Case
type: FunctionalProperty
type: ObjectProperty

capaciteit
usage note: TO DO
comment: TO DO
range: Waarde
type: ObjectProperty

ihm
range: Afvalstoffennzamelaar, afvalstoffenhandelaar of afvalstoffenmakelaar.
domain: Afval Overbrenging
type: ObjectProperty

exploitatie van
type: ObjectProperty

diepte onderkant
usage note: TO DO
comment: TO DO
range: Waarde
type: ObjectProperty

ander referentiepunt
usage note: TO DO
comment: TO DO
range: string
type: DatatypeProperty

andere monstername techniek
usage note: TO DO
comment: TO DO
range: string
domain: Monstername
type: DatatypeProperty

monsternummer
usage note: TO DO
comment: TO DO
range: string
domain: Monstername
type: DatatypeProperty

Een niet-uitgevoerde observatie
usage note: Wordt gebruikt om een spoor te hebben van een stuk vooringevulde aangifte die niet van toepassing was.
comment: Een observatie die je graag had gedaan, maar niet uitgevoerd is. Hier een vooringevuld deel van de aangifte die niet van toepassing was.
type: Class

ExploitatieStaat
usage note: Te gebruiken voor het opslaan van de tijdelijke status van een exploitatie.
comment: Geeft de staat (status) weer van een exploitatie op een bepaald moment in de tijd.
subclass of: State
type: Class

rest:
  rest: nil
  first:
    qualified cardinality: 1
    on data range: gYear
    on property: periode in de tijd
first:
  qualified cardinality: 1
  on class: SpatialThing
  on property: referentiegebied

oorzaak
usage note: TO DO
comment: Oorzaak van de emissie -- xs:string 1-255
range: string
type: DatatypeProperty

zuurstofgehalte
usage note: TO DO
comment: Reel zuurstof gehalte in procent -- xs:decimal met minInclusive = 0
range: Waarde
type: ObjectProperty

Aangifte productievolumes
type: Property

observatie van
domain: Observation
type: ObjectProperty

observatie
usage note: TO DO
comment: aan een activiteit gerelateerde observatie
range: Observation
inverse of: observatie van
type: ObjectProperty

Afval Overbrenging
subclass of: Activity
subclass of: Class
  intersection of:
    qualified cardinality: 1
    on class: Afvalstoffennzamelaar, afvalstoffenhandelaar of afvalstoffenmakelaar.
    on property: ihm
type: Class

ingedeelde inrichting of activiteit
usage note: TO DO
comment: link naar IngedeeldeInrichtingOfActiviteit
range: IngedeeldeInrichtingOfActiviteit
inverse of: ingedeelde inrichting of activiteit van
type: ObjectProperty

Aangifte afvalverwerker
type: Property

rest:
  rest: nil
  first:
    qualified cardinality: 1
    on data range: gYear
    on property: periode in de tijd
first:
  qualified cardinality: 1
  on class: Waarde
  on property: hoeveelheid

Uitnodiging
type: Property

Aangifte grondstoffenproducent
type: Property

peilfilter
usage note: TO DO
comment: TO DO
range: Class
  union of: Peilfilter
domain: Peilput
inverse of: peilfilter van
type: ObjectProperty

aantal dagen per jaar
usage note: TO DO
comment: TO DO
range: Waarde
type: ObjectProperty

naam
range: string
sub property of: label
type: DatatypeProperty
type: AnnotationProperty

peilmeting van
type: ObjectProperty

datum
range: date
type: DatatypeProperty

verwerkingswijze
range: Concept
domain: Afval Verwerking
type: ObjectProperty

Aangifte wateremissie
type: Property

grondwater diepte
usage note: OPGELET: binnen een datacube te gebruiken als datatype property. Buiten een datacube te gebruiken als objectproperty met als waarde een instance van imjv:Waarde.
comment: Diepte van de grondwatertafel
range: Class
  union of: decimal
  union of: Waarde
type: MeasureProperty
type: DatatypeProperty

Exploitant
usage note: Een exploitant heeft (minstens) een naam + adres (statutaire zetel of woonplaats).
comment: Een exploitant is een natuurlijke of rechtspersoon die (juridisch) aansprakelijk is voor de activiteiten en installaties op zijn locaties.
subclass of: Agent
subclass of: RegisteredOrganization
type: Class

diepte
usage note: TO DO
comment: TO DO
range: Waarde
type: ObjectProperty

Is een eenheid waarop de gpbv-regelgeving van toepassing is
range: boolean
type: DatatypeProperty

AfvalVerwerking
usage note: Te gebruiken bij de invoer van afval van buiten het Vlaams gewest.
comment: De afvalstoffen die in het jaar, voorafgaand aan de aangifte, van buiten Vlaanderen, ter verwerking, naar één bepaalde exploitatie in het Vlaamse Gewest zijn ingevoerd.
subclass of: Activity
subclass of: Class
  intersection of:
    some values from: Observation
    on property: subjectOf
type: Class

datum wegname
usage note: TO DO
comment: TO DO
range: date
domain: Entity
type: DatatypeProperty

WKT string (lambert72)
range: string
type: DatatypeProperty
type: Property

gemiddelde concentratie
usage note: TO DO
comment: TO DO
range: decimal
type: MeasureProperty
type: DatatypeProperty

toepassingsgebied
usage note: Indien discreet aantal waarden, codelijst maken
issued: 2023-02-01
comment: Toepassing van de energiedrager bij energieverbruik.
range: string
modified: 2023-02-01
type: Property
type: DimensionProperty

watnr
usage note: TO DO
comment: TO DO
range: string
domain: Class
  union of: Peilput
type: DatatypeProperty

exploitant
usage note: TO DO naar CBB
comment: TO DO
range: Exploitant
inverse of: exploitant van
equivalent property: onderneming
type: FunctionalProperty
type: ObjectProperty

Aangifte energie
type: Property

link naar BREF
usage note: TO DO
comment: TO DO
range: Concept
type: ObjectProperty

vestiging van
type: ObjectProperty

Aanvulling grondstoffenproducent
type: Property

Opgenomen oppervlaktewater
usage note: De meting van de hoeveelheid oppervlaktewater met verontreinigende stoffen op één punt, voor één jaar.
comment: Het oppompen van oppervlaktewater waarvoor een debiet kan gemeten worden.
subclass of: Activity
subclass of: Class
  intersection of:
    some values from: Observation
    on property: subjectOf
  intersection of:
    qualified cardinality: 1
    on class: SpatialThing
    on property: referentiegebied
  intersection of:
    qualified cardinality: 1
    on data range: gYear
    on property: periode in de tijd
type: Class

vervoerswijze
range: Concept
domain: Afval Overbrenging
type: ObjectProperty

Bijlage afvalproducent
type: Property

Energieproductie
usage note: Enegieproductie heeft betrekking op de installaties voor warmtekrachtkoppeling of de productie van: • stoom; • hete lucht; • elektriciteit; • warmte; • warm water
comment: Activiteiten die afname van energie mogelijk maken.
subclass of: Class
  intersection of:
    some values from: Observation
    on property: subjectOf
subclass of: Activity
type: Class

status van de exploitatie
usage note: TO DO
comment: TO DO
range: Concept
domain: Exploitatie
type: ObjectProperty
type: DimensionProperty

Is actief
range: boolean
type: DatatypeProperty

rest:
  rest: nil
  first:
    qualified cardinality: 1
    on data range: boolean
    on property: verwerking binnen bedrijf
first:
  some values from: Concept
  on property: verwerkingswijze

context van de emissie
usage note: TO DO
comment: TO DO
range: Concept
domain: Emissie
type: ObjectProperty

EmissiepuntStaat
usage note: Te gebruiken voor het opslaan van de tijdelijke status van een emissiepunt.
comment: Geeft de staat (status) weer van een emissiepunt op een bepaald moment in de tijd.
subclass of: State
type: Class

gpbv installatie van
type: ObjectProperty

Peilmeting
usage note: Het gewonnen volume wordt mee rergistreerd binnen iedere observatie.
comment: Een reeks van observaties mbt. de stijghoogte van een bepaalde watervoerende laag.
subclass of: Activity
type: Class

aantal uren per jaar
usage note: TO DO
comment: TO DO
range: Waarde
type: ObjectProperty

gekoppelde activiteit
usage note: TO DO
comment: TO DO
range: Activity
type: ObjectProperty

Inrichting of activiteit van
inverse of: inrichting of activiteit
type: ObjectProperty

rest:
  rest: nil
  first:
    qualified cardinality: 1
    on data range: gYear
    on property: periode in de tijd
first:
  qualified cardinality: 1
  on class: SpatialThing
  on property: referentiegebied

Exploitatie
usage note: Een exploitatie is de uitbating van een geheel van activiteiten en installaties (al dan niet vergunningsplichtig) door een welbepaalde exploitant en op een welbepaalde locatie.
comment: een exploitatie komt in principe in de meeste gevallen overeen met een exploitatiezetel. Exploitaties omvatten echter ook onbemande installaties die binnen bepaalde milieu-reglementeringen beschouwd worden als een onafhankelijke entiteit, maar binnen het vennootschapsrecht niet tot exploitatiezetels worden gerekend. In die zin is het begrip “exploitatiezetel” een deelverzameling van het begrip “exploitatie”.
subclass of: Site
subclass of: Class
  intersection of:
    some values from: Address
    on property: address
type: Class

Geleide lozing
usage note: De meting van de totale emmisie naar water van verontreinigende stoffen op één punt, voor één jaar.
comment: Een gecontroleerde lozing waarvoor een debiet kan gemeten worden.
subclass of: Class
  intersection of:
    some values from: Observation
    on property: subjectOf
  intersection of:
    qualified cardinality: 1
    on class: SpatialThing
    on property: referentiegebied
  intersection of:
    qualified cardinality: 1
    on data range: gYear
    on property: periode in de tijd
subclass of: Activity
type: Class

type van de emissie
usage note: TO DO
comment: TO DO
range: Concept
domain: Emissie
type: ObjectProperty

hoofd activiteit van
type: ObjectProperty

onderneming
usage note: TO DO naar KBO
comment: TO DO
type: FunctionalProperty
type: ObjectProperty

luchtoverschot
usage note: TO DO
comment: Procent luchtoverschot boven de stoechiometrische verhouding -- xs:decimal met minInclusive = 0
range: Waarde
domain: Emissie
type: ObjectProperty

KBO-nummer
range: KBO-nummer
type: Property
type: DatatypeProperty

exploitant van
type: ObjectProperty

type meetput
usage note: TO DO
comment: TO DO
range: Concept
type: ObjectProperty

inrichting of activiteit
comment: link naar inrichting of activiteit
range: InrichtingOfActiviteit
type: ObjectProperty

controleinstantie
usage note: TO DO
comment: De naam van het labo die de meting uitgevoerd heeft
range: string
type: DatatypeProperty
type: AttributeProperty

verwerking binnen bedrijf
range: boolean
domain: Afval Verwerking
type: DatatypeProperty

Bijlage wateremissie
type: Property

Aangifte grondwater
type: Property

uitvoerder
usage note: TO DO
comment: TO DO
range: string
domain: Activity
type: DatatypeProperty

key sleutel
range: string
sub property of: identifier
type: ObjectProperty
type: DatatypeProperty
type: InverseFunctionalProperty

beschrijving
comment: link naar de per jaar vastgelegde properties
type: ObjectProperty

Debietmeter
usage note: Instances van deze klasse zijn een meetinstrument.
comment: Een debietmeter is een meetinstrument waarmee in gesloten geheel gevulde leidingen de doorstroming van een gas of vloeistof per tijdseenheid gemeten kan worden. Elke grondwaterwinning moet beschikken over een verzegelde meter. Enkel onderstaande grondwaterwinningen vallen niet onder deze verplichting: - grondwaterwinningen uitgerust met een handpomp; - grondwaterwinningen voor huishoudelijke doeleinden tot maximaal 500 m³ per jaar (enkel voor gezinnen, niet voor bedrijven); - draineringen die noodzakelijk zijn om het gebruik en/of de exploitatie van bouw- en weilanden mogelijk te maken of te houden. - Voor de meeste grondwaterwinningen is deze verplichting al sinds 1 juli 1997 van kracht.
subclass of: Entity
subclass of: Class
  intersection of:
    cardinality: 1
    on property: merk
subclass of: Device
type: Class

type van lozing
usage note: TO DO: waarde uit gecontroleerd vocabularium
comment: TO DO
range: Concept
type: ObjectProperty

afstand maaiveld
usage note: TO DO
comment: TO DO
range: Waarde
type: ObjectProperty

eind meterstand
usage note: TO DO
comment: TO DO
range: Waarde
type: ObjectProperty

Aanvulling luchtemissie
type: Property

belangrijkste BREF
usage note: TO DO
comment: TO DO
range: Concept
sub property of: link naar BREF
type: FunctionalProperty
type: ObjectProperty

watergebruik
usage note: TO DO
comment: TO DO
range: Watergebruik
inverse of: watergebruik van
type: ObjectProperty

VE-nummer
type: Datatype

start meterstand
usage note: TO DO
comment: TO DO
range: Waarde
type: ObjectProperty

Monstername
usage note: Staalname.
comment: Het nemen van stalen (of monsters), kleine hoeveelheden, van producten of stoffen.
subclass of: Activity
type: Class

vlarem rubriek
usage note: TO DO
comment: TO DO
range: vlarem rubriek
type: FunctionalProperty
type: ObjectProperty

Productievolumes
type: Class

Aanvulling afvalproducent
type: Property

datum laboanalyse
usage note: TO DO
comment: TO DO
range: date
domain: Monstername
type: DatatypeProperty

monstername techniek
usage note: TO DO
comment: TO DO
range: Concept
domain: Monstername
type: ObjectProperty

Aangifte afvaloverbrenger
type: Property

Aanvulling grondwater
type: Property

verbrandingswaarde
range: Concept
type: CodedProperty
type: Property
usage note: Lijkt de eenheid te kwalificeren in de oorspronkelijke xml. Als iemand dit leest en weet wat het betekent, laat het me weten.
comment: De bovenste - of onderste verbrandingswaarde van andere energiebronnen
issued: 2023-02-01
code list: verbrandingswaarde
modified: 2023-02-01
type: DimensionProperty

de eenheid is ligt in een gebied dat hotspot voor fijn stof is aangeduidt
range: boolean
type: DatatypeProperty

filternummer
usage note: TO DO
comment: TO DO
range: string
domain: Class
  union of: Peilfilter
type: DatatypeProperty

bepalingsmethode
usage note: TO DO
comment: De methode waarop de emissie bepaald werd, te kiezen uit een vaste lijst met mogelijke methodes
range: Concept
type: FunctionalProperty
type: ObjectProperty

energiedrager
comment: De energiedrager, wat enthalpie heeft
type: CodedProperty
type: DimensionProperty
type: Property
code list: energiedrager
range: Concept
issued: 2023-02-01
usage note: Waarde uit https://data.imjv.omgeving.vlaanderen.be/id/conceptscheme/energiedrager
modified: 2023-02-01

blijvend buiten werking
usage note: TO DO
comment: Zet deze tag op true indien het emissiepunt niet langer in gebruik is. Volgend jaar zal het emissiepunt niet langer voorkomenin de vaste gegevens.
range: boolean
type: DatatypeProperty

eprtr Code
range: integer
domain: PrtrInrichting
type: DatatypeProperty

exploitatie
comment: TO DO
range: Exploitatie
inverse of: exploitatie van
type: ObjectProperty
type: FunctionalProperty

situatie rapport
range: Concept
type: ObjectProperty

plaats van lozing
usage note: TO DO: waarde uit gecontroleerd vocabularium
comment: TO DO
range: Concept
type: ObjectProperty

meetfrequentie
usage note: TO DO
comment: Het aantal metingen (integer MeetfrequentieDiscreet of boolean MeetfrequentieContinue
range: integer
type: DatatypeProperty

tijd laboanalyse
usage note: TO DO
comment: TO DO
range: time
domain: Monstername
type: DatatypeProperty

BKG-installatie
usage note: TO DO
comment: TO DO
range: BroeikasgasInstallatie
inverse of: broeikasgasInstallatieVan
type: ObjectProperty

gebaseerd op
usage note: gebruikt om eigen meeteenheden te relateren aan QUDT units
comment: TO DO
type: ObjectProperty

merk
usage note: TO DO
comment: TO DO
range: string
domain: Entity
type: DatatypeProperty

PompputStaat
usage note: Te gebruiken voor het opslaan van de tijdelijke status van een pompput.
comment: Geeft de staat (status) weer van een pompput op een bepaald moment in de tijd.
subclass of: Class
  intersection of:
    qualified cardinality: 1
    on class: Pompput
    on property: stateOf
subclass of: State
type: Class

Bijlage energie
type: Property

debiet
usage note: TO DO
comment: Debiet zonder verdunning van de afvalgassen in Nm3/uur -- xs:decimal met minInclusive = 0
range: Waarde
domain: Class
  union of: Emissie
type: ObjectProperty

Verwerker
subclass of: Class
  intersection of:
    some values from: string
    on property: identificatienummer
subclass of: Agent
type: Class

ingedeelde inrichting of activiteit van
type: ObjectProperty

x-coördinaat (lambert72)
usage note: TO DO
comment: Type definitie voor een lambertcoordinaat met restricties voor Vlaanderen op de x-as (De X-coordinaat uitgedrukt in meter) -- xs:double met minIncl = 22000 en maxIncl = 259000
range: double
domain: Point
type: DatatypeProperty

pompfilter van
type: ObjectProperty

rie rubriek
usage note: TO DO
comment: TO DO
range: Concept
domain: InrichtingOfActiviteit
type: ObjectProperty

Afvalstoffennzamelaar, afvalstoffenhandelaar of afvalstoffenmakelaar.
comment: Geregistreerde inzamelaars, afvalstoffenhandelaars of –makelaars met OVAM-nummers.
subclass of: Class
  intersection of:
    some values from: string
    on property: identificatienummer
  intersection of:
    some values from: string
    on property: naam
type: Class

Handhavingovam
type: Property

verbruikt volume
range: decimal
type: DatatypeProperty

vracht
usage note: TO DO
comment: TO DO
range: Waarde
type: AttributeProperty
type: ObjectProperty

KBO-nummer
type: Datatype

debietmeter
range: Debietmeter
inverse of: debietmeter van
type: ObjectProperty

land van herkomst
range: Concept
type: FunctionalProperty
type: ObjectProperty

tijd pompen stil
usage note: TO DO
comment: TO DO
range: duration
type: AttributeProperty
type: DatatypeProperty

Bijlage identificatie
type: Property

ondernemingsnummer
range: string
type: DatatypeProperty

peilmeting
usage note: TO DO
comment: TO DO
range: Peilmeting
inverse of: peilmeting van
type: ObjectProperty

certificaat secundaire grondstof
range: string
type: DatatypeProperty

Processchema luchtemissie
type: Property

identificatienummer
range: string
type: DatatypeProperty

gebruikt als secundaire grondstof
range: boolean
domain: Afval Verwerking
type: DatatypeProperty

gewest van herkomst
range: string
domain: AfvalVerwerking
type: DatatypeProperty

Aanvulling wateremissie
type: Property

LozingspuntStaat
usage note: Te gebruiken voor het opslaan van de tijdelijke status van een lozingspunt.
comment: Geeft de staat (status) weer van een lozingspunt op een bepaald moment in de tijd.
subclass of: Class
  intersection of:
    qualified cardinality: 1
    on class: Lozingspunt
    on property: stateOf
  intersection of:
    cardinality: 1
    on property: date
subclass of: State
type: Class

peilfilter van
type: ObjectProperty

Peilput
usage note: Een peilput kan een peilfilter bevatten.
comment: Een boring waarin men de stijghoogte van het grondwater, uit een bepaalde watervoerende laag, kan meten.
subclass of: Class
  intersection of:
    on class: Peilfilter
    min qualified cardinality: 1
    on property: peilfilter
subclass of: Location
type: Class

zuurtegraad
usage note: TO DO
comment: TO DO
range: decimal
domain: Geleide lozing
type: DatatypeProperty

identifier binnen GPBV
range: string
sub property of: identifier
type: InverseFunctionalProperty
type: ObjectProperty
type: DatatypeProperty

Metadata
type: Property

EPRTR inrichting
usage note: TO DO
comment: TO DO
range: PrtrInrichting
type: ObjectProperty
type: DatatypeProperty

analysemethode
usage note: TO DO
comment: TO DO
range: string
type: DatatypeProperty

verslagversie
usage note: Te gebruiken om aan te tonen to welke versie van een verslag de entiteit behoort
comment: De versie van een verslag
range: integer
domain: Entity
type: DatatypeProperty

productievolume status
code list: productievolume status
range: Concept
sub property of: status
type: CodedProperty
type: Property
type: DimensionProperty

emissieduur
usage note: TO DO
comment: Aantal uur per jaar -- xs:int
range: Waarde
domain: Emissie
type: ObjectProperty

Aangifte afvalproducent
type: Property

Emissiepunt
usage note: Met emissiepunt worden zowel geleide bronnen (schoorsteen, uitlaatpijp...) als niet-geleide bronnen (installatie, apparaat, flenzen, gebouwen, tanks, fakkels...) bedoeld.
comment: Punt waarop de emissie gemeten is. Punt (of groep van punten) waar één of meerdere gevaarlijke - of verontreinigende stof(fen) bedoeld of onbedoeld uit een gesloten systeem treedt.
subclass of: Location
type: Class

verwerking van
type: ObjectProperty

zuiverings apparatuur van
type: ObjectProperty

periode in de tijd
usage note: te gebruiken als timePeriod dimensie op een observatie. In deze context gYear als waarde gebruiken.
comment: periode in de tijd waarop de observatie slaat
range: gYear
sub property of: timePeriod
type: AnnotationProperty
type: DatatypeProperty
type: DimensionProperty

in droge toestand opgegeven (boolean)
usage note: TO DO
comment: True indien de waarden (debiet en zuurstofgehalte) in droge toestand opgegeven worden, anders False
range: boolean
type: DatatypeProperty

Organisatie status
usage note: gebruik om een activiteitscode (SKOS concept) in te geven gecombineerd met een datum (bv. actief op 2013-01-01)
comment: klasse om de status van een organisatie aan te geven
type: Class

PeilputStaat
usage note: Te gebruiken voor het opslaan van de tijdelijke status van een peilput.
comment: Geeft de staat (status) weer van een peilput op een bepaald moment in de tijd.
subclass of: State
type: Class

start datum
range: Class
  union of: date
type: ObjectProperty
type: DatatypeProperty

Bijlage afvalverwerker
type: Property

analyse type
usage note: TO DO
comment: TO DO
range: Concept
type: ObjectProperty
type: FunctionalProperty

watergebruik van
type: ObjectProperty

y-coördinaat (lambert 72)
usage note: TO DO
comment: Type definitie voor een lambertcoordinaat met restricties voor Vlaanderen op de y-as (De Y-coordinaat uitgedrukt in meter) -- xs:double met minIncl = 152000 en maxIncl = 245000
range: double
domain: Point
type: DatatypeProperty

Emissie
usage note: Op één emissie kunnen er meerdere observaties van verschillende verontreinigende stoffen gebeuren. Enkel deze verontreinigende stoffen, boven een bepaalde drempel, waarvoor er meldingsplicht is binnen het IMJV, worden tot de observaties gerekend.
comment: Emissie is de uitstoot of lozing van de verontreinigingen, die door een bron worden uitgeworpen op een bepaalde plaats over een welbepaalde periode.
subclass of: Class
  intersection of:
    some values from: Observation
    on property: subjectOf
subclass of: Activity
type: Class

Abnormale lozing
usage note: De meting van de totale emmisie naar water van verontreinigende stoffen ten gevolge van een ongecontroleerde, accidentele lozing.
comment: Een ongecontroleerde lozing waarvoor een debiet kan gemeten worden.
subclass of: Activity
subclass of: Class
  intersection of:
    some values from: Observation
    on property: subjectOf
  intersection of:
    qualified cardinality: 1
    on class: SpatialThing
    on property: referentiegebied
  intersection of:
    qualified cardinality: 1
    on data range: gYear
    on property: periode in de tijd
type: Class

overbrenging
range: Afval Overbrenging
inverse of: overbrenging van
type: ObjectProperty

serienummer
usage note: TO DO
comment: TO DO
range: string
domain: Device
type: DatatypeProperty

EnergieVerbruik
usage note: Overzicht energieverbruik binnen een exploitatie.
comment: Totale energieverbruik binnen de periode van een jaar voor een bepaalde exploitatie.
subclass of: Class
  intersection of:
    some values from: Observation
    on property: subjectOf
subclass of: Activity
type: Class

gpbv installatie
range: GpbvInstallatie
inverse of: gpbv installatie van
type: ObjectProperty

niet gebruikt als secundaire grondstof
range: boolean
domain: Afval Verwerking
type: DatatypeProperty

Aangifte identificatie
type: Property

watergehalte
usage note: TO DO
comment: Watergehalte uitgedrukt in procent -- xs:decimal met minInclusive = 0
range: Waarde
type: ObjectProperty

Waterbalans staat
subclass of: State
subclass of: Class
  intersection of:
    qualified cardinality: 1
    on class: Waterbalans
    on property: stateOf
type: Class

ander instrument peilmeting
range: string
domain: Peilmeting
type: DatatypeProperty

Processchema wateremissie
type: Property

massastroom
usage note: TO DO
comment: de uitgestoten massa van de stof -- xs:decimal met minInclusive = 0
range: Waarde
type: ObjectProperty

referentiepunt type
usage note: TO DO
comment: TO DO
range: Concept
domain: Class
  union of: Monstername
type: ObjectProperty

vlarem rubriek
usage note: TO DO
comment: TO DO
range: vlarem rubriek
sub property of: cited by
type: AnnotationProperty
type: ObjectProperty

Watergebruik
usage note: TO DO
comment: TO DO
subclass of: Activity
subclass of: Class
  intersection of:
    some values from: Observation
    on property: subjectOf
type: Class

temperatuur
usage note: TO DO
comment: In °C -- xs:decimal met minInclusive = 0
range: Waarde
type: ObjectProperty

omschrijving afvalstof
range: string
type: DatatypeProperty

hoogte
usage note: TO DO
comment: Hoogte (in meter) -- xs:decimal met minInclusive 0
range: Waarde
type: ObjectProperty

aquifer
usage note: TO DO
comment: Watervoerende laag
range: Concept
type: ObjectProperty

Aanvulling energie
type: Property

referentiegebied
usage note: wordt gebruikt voor de refArea dimensie van een observatie
comment: locatie/gebied waar de observatie gemeten is
range: SpatialThing
sub property of: refArea
type: ObjectProperty
type: AnnotationProperty
type: DimensionProperty

PompfilterStaat
usage note: Te gebruiken voor het opslaan van de tijdelijke status van een pompfilter.
comment: Geeft de staat (status) weer van een pompfilter op een bepaald moment in de tijd.
subclass of: State
type: Class

Lozingspunt
usage note: Elk punt wordt geïdentificeerd door een meetputnummer van de VMM. Het meetputtype is lozend voor lozingen in oppervlaktewater of op niet-gekoppelde (op RWZI) riolering. Enkel de lozingspunten met een meetputType lozend, zijn lozingspunten waar lozingen van stoffen in oppervlaktewater plaats vinden.
comment: Een punt waar opgepompt, getransfereerd of geloosd wordt.
subclass of: Location
type: Class

Peilfilter
usage note: Een perforatie, aangebracht in de peilput, om een luchtinlaat te verzekeren. Dit is noodzakelijk om bij variërende waterstanden, in de peilbuis, als gevolg van pompcycli, geen onder- of overdrukken te creëren die tot verkeerde meetresultaten zouden leiden.
comment: De filter in de peilput.
subclass of: Device
subclass of: Entity
type: Class

VE-nummer
range: VE-nummer
type: Property
type: DatatypeProperty

Bijlage grondwater
type: Property

Pompfilter
comment: Een filter in een pompput.
subclass of: Device
subclass of: Entity
type: Class

einddatum
range: Class
  union of: date
type: ObjectProperty
type: DatatypeProperty

observatieobject
range: string
type: DatatypeProperty
type: DimensionProperty